has time parameter
type: ObjectProperty
version info: provvisoria @it
comment: This property allows one to represent a specific parameter or quality for the temporal entity. This property can be used when, in certain domains, it is necessary to model for example dates that are actual or estimated or anticipated or projected etc. The Characteristic class of the range of the property can then be instantiating with the property l0:name whose value can be for instance "actual", "estimated", etc.
label: ha parametro temporale @it
range: Characteristic
version info: unstable
domain: TemporalEntity
comment: Questa proprietà permette di rappresentare un parametro o una qualità specifica per l'entità temporale. Questa proprietà può essere utilizzata quando, in determinati domini, è necessario modellare ad esempio date effettive o stimate, ecc. La classe caratteristica del codominio della proprietà può quindi essere istanziata con la proprietà l0:name il cui valore può essere ad esempio "effettiva", "stimata", ecc. @it