è giorno della settimana di
type: ObjectProperty
comment: Proprietà inversa di "ha giorno della settimana".
comment: Inverse property of has day of week. @en
range: Thing
domain: DayOfWeek
label: is day of week of @en
sub property of: isTemporalEntityOf