is year of
type: ObjectProperty
comment: Property that links a year to a time indexed event.
comment: Proprietà che collega un anno ad un evento nel tempo. @it
range: Thing
domain: Year
label: è anno di @it
sub property of: isTemporalEntityOf