è parte di evento
type: ObjectProperty
comment: Questa proprietà è utilizzata per collegare un servizio pubblico a un evento (evento della vita del cittadino o evento della vita di attività commerciale)
domain: PublicService
label: is part of event @en
range: EventOrSituation
version info: stable @en
inverse of: isEventForPS
comment: This property is used to link a public services to an Event (Business or Life event) @en
version info: stabile