Attività
type: Class
comment: La classe delle attività svolte da qualche agente.
label: Activity @en
subclass of: Entity
comment: The class of activities carried out by an agent. @en
version info: stable @en
version info: stabile