Agente
type: Class
comment: Any agentive Object , either physical (e.g. a person, a robot, an oak), or social (e.g. a corporation, an institution, a community). @en
comment: Un agente, sia fisico (ex. una persona, un robot, una quercia), o sociale (ex. una società, un'istituzione, una comunità).
comment: un agente, sia fisico (ex. una persona, un robot, una quercia), o sociale (ex. una società, un'istituzione, una comunità)
label: Agent @en
subclass of: Object
subclass of: Entity
subclass of: Restriction
  all values from: TimeIndexedRole
  on property: holdsRoleInTime
disjoint with: Concept
disjoint with: EventOrSituation
disjoint with: Description
disjoint with: BeneficiarioDomandaGestioneSeparata
disjoint with: Restriction
  on property:
    inverse of: holdsRoleInTime
  some values from: Agente
disjoint with: Restriction
  on property:
    inverse of: holdsRoleInTime
  some values from: Agente
disjoint with: Restriction
  on property:
    inverse of: holdsRoleInTime
  some values from: Agente
version info: stable @en
version info: stabile