Object
type: Class
comment: Any entity that tends to be stable in time, either in the physical or social world. Examples include homes, cities, organizations, works of art, natural objects, artifacts, words, ideas, etc. Objects are opposable to events, since events typically flow in time, aggregating multiple objects during their flow, as with working, travelling or leisure activities, industrial or athmospheric processes, etc.
version info: stabile @it
subclass of: Entity
comment: Ogni entità che tende a essere stabile in un tempo più o meno lungo, sia nel mondo fisico sia sociale. Gli esempi includono case, città, organizzazioni, opere d'arte, oggetti del mondo naturale, artefatti, parole, idee, etc. GLi oggetti si possono contrapporre agli eventi, che invece scorrono nel tempo, aggregando oggetti diversi nel loro scorrere, come accade per esempio nei processi industriali o atmosferici, nelle attività di lavoro, viaggio o divertimento, etc. @it
version info: stable
label: Oggetto @it