has member
type: ObjectProperty
inverse of: isMemberOf
version info: stable
version info: stabile @it
range: Entity
comment: La proprietà che modella la relazione di membership. @it
comment: The object property that models the membership relation.
label: ha membro @it
domain: Collection