ha membro
type: ObjectProperty
comment: La proprietà che modella la relazione di membership.
comment: The object property that models the membership relation. @en
domain: Collection
label: has member @en
range: Entity
inverse of: isMemberOf
version info: stable @en
version info: stabile