Comunicazione Bidirezionale
type: Class
comment: Servizio previsto dal Cassetto per il Lavoro Domestico che ha come principale obiettivo la realizzazione di una modalità strutturata di comunicazione tra il datore di lavoro e l’Istituto. Con questa funzionalità il datore di lavoro domestico può inviare alla sede di competenza una richiesta scegliendo un oggetto tra quelli disponibili (anagrafiche, MAV, contributi, rapporto di lavoro, ecc.). È possibile allegare la documentazione a supporto alla richiesta.
comment: Service provided by the Domestic Work Drawer which has as its main objective the creation of a structured mode of communication between the employer and the Institute. With this functionality, the domestic employer can send a request to the relevant office by choosing an object from those available (personal data, MAV, contributions, employment relationship, etc.). It is possible to attach supporting documentation to the request. @en
label: Bidirectional Communication @en
subclass of: Restriction
  max cardinality: 3
  on property: haDocumentoAllegato
subclass of: Restriction
  on property: haStatoComunicazioneBidirezionale
  some values from: Thing
subclass of: Restriction
  on property: dataAperturaComunicazioneBidirezionale
  some values from: Literal
subclass of: Restriction
  on property: comunicazioneBidirezionaleRiguardaRapportoDiLavoroDomestico
  some values from: Thing
subclass of: Restriction
  on property: haDettaglioComunicazioneBidirezionale
  some values from: Thing
subclass of: Restriction
  on property: descrizioneRichiesta
  some values from: Literal
subclass of: Restriction
  on property:
    inverse of: invianoComunicazioneBidirezionale
  some values from: Thing
subclass of: Restriction
  on property: codiceProtocolloComunicazioneBidirezionale
  some values from: Literal
subclass of: Restriction
  on property: destinatario
  some values from: Literal
subclass of: Restriction
  on property: haEsitoComunicazioneBidirezionale
  some values from: Thing
subclass of: Restriction
  on property: canaleNotificaRisposta
  some values from: Literal
subclass of: Restriction
  on property: dataChiusuraComunicazioneBidirezionale
  some values from: Literal
subclass of: Restriction
  on property: mittente
  some values from: Literal
subclass of: Restriction
  on property: oggettoRichiesta
  some values from: Literal
subclass of: Restriction
  on property: noteOggetto
  some values from: Literal