Rapporto Di Lavoro Domestico Annullato
type: Class
comment: Classe che identifica, se presenti negli archivi INPS, tutti i rapporti di lavoro negli ultimi cinque anni che non sono stati annullati in quanto mai sussistiti.
comment: Class that identifies, if exist in the INPS archives, all employment relationships in the last five years that have not been canceled as they never existed. @en
label: Domestic Employment Relationship Cancelled @en
subclass of: StatoFinaleRapportoDILavoroDomestico
subclass of: RapportoDiLavoroDomestico
subclass of: Restriction
  on property: rapportoDiLavoroDomesticoAnnullatoHaStatoPrecedente
  some values from: Thing
subclass of: Restriction
  on property:
    inverse of: annullaRapportoDiLavoroDomestico
  some values from: Thing
subclass of: Restriction
  on property:
    inverse of: trasformaRapportoDiLavoroDomesticoCessato
  some values from: Thing
subclass of: Restriction
  on property: annullatoDa
  some values from: Thing
subclass of: Restriction
  on property:
    inverse of: prorogaRapportoDiLavoroDomesticoCessato
  some values from: Thing
subclass of: Restriction
  on property: dataPresentazioneAnnullamento
  some values from: Literal