Domestic Employment Relationship Under Verification
type: Class
comment: Class that identifies, if exist in the INPS archives, all employment relationships of the last five years that are being verified at the headquarters.
comment: Classe che identifica, se presenti negli archivi INPS, tutti i rapporti di lavoro degli ultimi cinque anni che sono in verifica presso la sede. @it
label: Rapporto Di Lavoro Domestico In Verifica @it
subclass of: RapportoDiLavoroDomestico
subclass of: StatoIntermedioRapportoDiLavoroDomestico
subclass of: Restriction
  on property:
    inverse of: rapportoDiLavoroDomesticoRespintoHaStatoPrecedente
  some values from: Thing
subclass of: Restriction
  on property: valutatoDa
  some values from: Thing
subclass of: Restriction
  on property: rapportoDiLavoroDomesticoInVerificaHaStatoPrecedente
  some values from: Thing
subclass of: Restriction
  on property:
    inverse of: rapportoDiLavoroDomesticoAccoltoHaStatoPrecedente
  some values from: Thing
subclass of: Restriction
  on property:
    inverse of: esitoValutazioneAutomaticaConRilevazioneDelRischioGenera
  some values from: Thing
subclass of: Restriction
  on property: inVerificaPresso
  some values from: Thing
disjoint with: RapportoDiLavoroDomesticoIscritto