Domestic Employment Relationship Rejected
type: Class
subclass of: Restriction
  some values from: Thing
  on property:
    inverse of: esitoValutazioneConRilevazioneRischioGenera
subclass of: Restriction
  some values from: Literal
  on property: dataRespingimento
subclass of: RapportoDiLavoroDomestico
subclass of: Restriction
  some values from: Thing
  on property: rapportoDiLavoroDomesticoRespintoHaStatoPrecedente
subclass of: Restriction
  some values from: Thing
  on property: respintoDa
subclass of: StatoFinaleRapportoDILavoroDomestico
label: Rapporto Di Lavoro Domestico Respinto @it
comment: Class which identifies, if exist in the INPS archives, all employment relationships of the last five years which have been verified by the INPS office with negative results.
comment: Classe che identifica, se presenti negli archivi INPS, tutti i rapporti di lavoro degli ultimi cinque anni che sono stati verificati dalla sede INPS con esito negativo. @it