Autore
type: Class
comment: La classe Autore rappresenta il soggetto che ha capacità e competenza a produrre il documento
comment: The Author class represents the subject who has the ability and competence to produce the document @en
label: Author @en
equivalent class: Restriction
  some values from: Literal
  on property: nomeAutore
subclass of: Agent