Responsabile del documento
type: Class
comment: La classe rappresenta la persona fisica responsabile del contenuto del documento
comment: The class represents an individual responsible for the content of the document @en
label: Document Responsible @en
subclass of: Person
subclass of: RuoloDiPersonaViva