calcolata sulla base dei contributi versati
type: ObjectProperty
comment: La object property collega la liquidazione di pensione con l'anzianità contributiva, evidenziando il nesso tra la liquidazione e l'anzianità contributiva in qualità di elemento fondamentale per per il calcolo degli importi da liquidare
comment: The object property links the pension payment with the contributory seniority @en
range: AnzianitaContributiva
domain: LiquidazionePensione
label: calculated on the basis of the contributions paid @en