author's name
type: DatatypeProperty
comment: name of the person who has the authority to issue the document
comment: nome del soggetto che ha autorità ad emettere il documento @it
domain: Autore
label: nome dell'autore @it