structured in
type: ObjectProperty
comment: The object property connects the representative class of the pension determination document with the structural elements it is composed of
comment: La object property collega la classe rappresentativa del documento di determina di pensione con gli elementi strutturali di cui si compone @it
domain: DeterminaDiPensione
label: strutturato in @it
range: Class
  union of: Protocollo
  union of: Sottoscrizione