causale pagamento prestazione pensionistica
type: DatatypeProperty
type: FunctionalProperty
comment: Indicates the reason for the payment of the pension benefit paid
comment: Indica la causale del pagamento della prestazione pensionistica erogata @it
comment: pension benefit payment causal
domain: PagamentoPrestazionePensionistica