ha datore di lavoro
type: ObjectProperty
comment: Relzione tra una attività estera e il relativo e unico datore di lavoro.
comment: Relationship between a foreign activity and the related and only employer. @en
range: DatoreDiLavoro
domain: AttivitaEstera
label: has employer @en
type: FunctionalProperty