has pension fund
type: ObjectProperty
type: FunctionalProperty
comment: Binds a pension product to the pension fund chosen in the application phase.
comment: Lega un prodotto pensionistico al fondo pensionistico prescelto in fase di domanda. @it
range: FondoPensionistico
domain: ProdottoPensionistico
label: ha fondo pensionistico @it