payment benefit pension managed by
type: ObjectProperty
type: FunctionalProperty
comment: Defines the relationship between the PagamentoPrestazionePensionistica class and the SedeINPS class
comment: Definisce la relazione tra la classe PagamentoPrestazionePensionistica e la classe SedeINPS @it
domain: PagamentoPrestazionePensionistica
label: pagamento prestazione pensionistica gestita da @it