paymentPensionBenefitIsPaidTo
type: ObjectProperty
type: FunctionalProperty
comment: Defines the relationship between the PagamentoPrestazionePensionistica class and the TitolarePP class
comment: Definisce la relazione tra la classe PagamentoPrestazionePensionistica e la classe TitolarePP @it
domain: PagamentoPrestazionePensionistica
label: pagamento prestazione pensionistica viene erogato a @it
range: TitolarePP