group sharing
type: ObjectProperty
comment: Relationship between a pension service and the group service concerning him.
comment: Relazione tra un servizio pensionistico e il servizio di gruppo che lo riguarda. @it
range: ServizioDiGruppo
domain: ServizioPensionistico
label: partecipa a gruppo @it
type: FunctionalProperty
type: InverseFunctionalProperty