pension benefit in charge of
type: ObjectProperty
comment: Defines the relationship between the PrestazionePensionistica class and the SedeINPS class
comment: Definisce la relazione tra la classe PrestazionePensionistica e la classe SedeINPS @it
range: SedeINPS
domain: PrestazionePensionistica
label: prestazione pensionistica in carico a @it
type: FunctionalProperty