pension benefit in force
type: DatatypeProperty
comment: Boolean property that allows you to indicate whether the pension benefit is in place or not
comment: Proprietà booleana che consente di indicare se la prestazione pensionistica è in essere oppure no @it
domain: PrestazionePensionistica
label: prestazione vigente @it
type: FunctionalProperty