fund grouping
type: ObjectProperty
comment: Associates with a pension scheme its funds. A fund belongs to one and a single scheme.
comment: Associa a una gestione pensionistica i suoi fondi. Un fondo appartiene ad una e un sola gestione. @it
range: FondoPensionistico
domain: GestionePensionistica
label: raggruppa fondo @it
type: InverseFunctionalProperty