pension scheme grouping
type: ObjectProperty
comment: Relationship between a pension group service type that is a pension profile with a pension scheme that admits that profile. Each scheme must admit at least one pension profile.
comment: Relazione tra un tipo di servizio di gruppo ovvero una forma pensionistica con una gestione che ammette tale forma pensionistica. Ciascuna gestione deve ammettere almeno una forma pensionistica. @it
domain: TipoDiServizioDiGruppo
label: raggruppa gestione @it
range: GestionePensionistica