raggruppa servizio
type: ObjectProperty
comment: Relazione tra un gruppo servizio pensionistico e il servizio di gruppo che lo riguarda.
comment: Relationship between a pension service group and the group service concerning him. @en
range: ServizioDiGruppo
domain: GruppoServizioPensionistico
label: grouping service @en
type: InverseFunctionalProperty