relativa a prodotto pensionistico
type: ObjectProperty
type: FunctionalProperty
comment: Definisce la relazione tra la classe PrestazionePensionistica e la classe ProdottoPensionistico
comment: Defines the relationship between the PrestazionePensionistica class and the ProdottoPensionistico class @en
domain: PrestazionePensionistica
label: related to pension product @en
range: ProdottoPensionistico