is consulted through payment status
type: ObjectProperty
type: FunctionalProperty
comment: Defines the relationship between the PagamentoPrestazionePensionistica class and the StatoDelPagamento class
comment: Definisce la relazione tra la classe PagamentoPrestazionePensionistica e la classe StatoDiPagamento @it
domain: PagamentoPrestazionePensionistica
label: viene consultato tramite stato di pagamento @it
range: StatoDelPagamento