Spilt scheme application form
type: Class
comment: The Spilt Scheme Application Form is the official form that has to be sent to the INPS service in order to register for this contribution scheme and access an user details summary . Either a beneficiary or an authorised delagate can fill in the application form. The required information that must be filled out are: person details, employment status, job title and employment start date. The Spilt scheme application form is a superclass of the Self employed spilt scheme application form and the dependent contractor spilt scheme application form. Those ones are in fact two different forms based on a employee status.
comment: La domanda di iscrizione alla gestione separata è il documento che il beneficiario o un suo delegato invia all'INPS per richiedere l'iscrizione alla Gestione separata e recante le informazioni necessarie a tale scopo, come: dati anagrafici, tipologia di lavoratore, tipologia di attività, data di inizio dell'attività lavorativa. Nell'ontologia che descrive i procedimenti legati all'iscrizione dei lavoratori parasubordinati e dei liberi professionisti la classe è modellata come superclasse di Domanda Iscrizione gestione Separata Libero Professionista e Domanda Iscrizione Gestione Separata Parasubordinato, che rappresentano sue specializzazioni. Inoltre nell'ontologia la domanda di iscrizione è interpretata e descritta come documento compilato e inviato dal soggetto interessato e ricevuto da INPS entrando a far parte dei suoi archivi. @it
label: Domanda iscrizione gestione separata @it
subclass of: Document
subclass of: Object
equivalent class: Restriction
  on property:
    inverse of: inviaDomandaIscrizioneGestioneSeparata
  some values from: Thing
equivalent class: Restriction
  on property: dataInizioAttivita
  some values from: Literal
equivalent class: Restriction
  on property: email
  some values from: Literal
equivalent class: Class
  union of: DomandaIscrizioneGestioneSeparataLiberoProfessionista
  union of: DomandaIscrizioneGestioneSeparataParasubordinato
equivalent class: Restriction
  on property: PEC
  some values from: Literal
equivalent class: Restriction
  on property: dataPresentazioneIscrizioneGestioneSeparata
  some values from: Literal
equivalent class: Restriction
  on property: domandaIscrizioneGestioneSeparataInviataA
  some values from: Thing
equivalent class: Restriction
  on property: telefono
  some values from: Literal
equivalent class: Restriction
  on property: generaIscrizioneGestioneSeparata
  some values from: Thing
equivalent class: Restriction
  on property: numeroProtocolloIscrizioneGestioneSeparata
  some values from: Literal