ATECOCode
type: DatatypeProperty
comment: ATECO code is used to identify a self employed person's areas of work.
comment: Codice identificativo dell'attività svolta dal lavoratore secondo la classificazione ATECO @it
domain: DomandaIscrizioneGestioneSeparataLiberoProfessionista
label: codice attivita ATECO @it
type: FunctionalProperty