hasContributions
type: ObjectProperty
comment: This object property links together the Spilt Scheme Registration class and the Spilt Scheme Contributions class. Once registered with the Spilt Scheme you must pay your credited contributions into the Scheme Account.
comment: La relazione connette tra loro le classi Iscrizione gestione separata e Contributo gestione separata per descrivere l'obbligo di versamento dei contributi conseguente all'iscrizione del lavoratore alla gestione previdenziale. @it
domain: IscrizioneGestioneSeparata
label: generaContributi @it
range: ContributoGestioneSeparata