iscriveLavoratoreInGestioneSeparata
type: ObjectProperty
comment: La relazione collega la classe Iscrizione gestione separata alla classe gestione separata per indicare come, nei fatti, sia l'azione di iscrizione alla gestione separata ad iscrivere il lavoratore a questa gestione previdenziale.
comment: This object property links together the Spilt Scheme Registration class and the Spilt Scheme class. Once applied to the Scheme you become an effective Spilt Scheme member. @en
range: GestioneSeparata
domain: IscrizioneGestioneSeparata
label: enrolApplicantInSpiltScheme