versatiInGestioneSeparata
type: ObjectProperty
comment: La proprietà esprime il collegamento tra la classe Contributi gestione separata e la classe Gestione separata, con lo scopo di formalizzare il legame tra questa categoria di contributo previdenziale obbligatorio e il fondo pensionistico nel quale vengono versati
comment: This object property links together the Spilt Scheme Contributions class and the Spilt Scheme class. It refers to the fact that once registered a member pays their contributions into the Spilt Scheme. Contributions are used to fund social welfare benefits and pensions. @en
range: GestioneSeparata
domain: ContributoGestioneSeparata
label: hasContributionsPaidIntoSpiltScheme @en