Canale Acquisizione
type: Class
comment: Modalità con cui avviene l'acquisizione della denuncia INAIL
label: Acquisition Channel @en
subclass of: Restriction
  on property: codiceCanaleAcquisizione
  some values from: Literal
subclass of: Restriction
  on property: codiceTipoCanaleAcquisizione
  some values from: Literal
subclass of: Restriction
  on property: descrizioneTipoCanaleAcquisizione
  some values from: Literal
subclass of: Restriction
  on property:
    inverse of: denunciaRelativaACanaleAcquisizione
  some values from: Thing
subclass of: Restriction
  on property: descrizioneCanaleAcquisizione
  some values from: Literal