Fascia Numero Lavoratori
type: Class
comment: Specifica fascia della suddivisione in fasce del numero di lavoratori.
label: Workers Number Range @en
subclass of: Restriction
  some values from: Literal
  on property: codiceLivello1
subclass of: Restriction
  some values from: Thing
  on property:
    inverse of: soggettoAssicuranteHaFasciaNumeroLavoratori
subclass of: Restriction
  some values from: Literal
  on property: codiceLivello2
subclass of: Restriction
  some values from: Literal
  on property: descrizioneLivello1
subclass of: Restriction
  some values from: Literal
  on property: descrizioneLivello2