lavorazioni Complementari E Sussidiarie
type: DatatypeProperty
comment: Le operazioni complementari e sussidiarie sono quelle svolte in connessione operativa con l’attività principale
domain: Attivita