percentuale Incidenza
type: DatatypeProperty
comment: La percentuale da attribuire alla retribuzione nel caso di voci in ponderazione, tale percentuale viene indicata al 100% qualora la posizione assicurativa non risulti ponderata.
domain: Attivita