Assegno bancario o postale
type: Class
comment: Strumento di pagamento sostitutivo del contante con il quale il titolare del conto corrente (traente) ordina alla propria banca (trattario) di versare una determinata somma di denaro a favore di un'altra persona. Consente di effettuare pagamenti, anche di importo rilevante, senza utilizzare il denaro contante. Gli assegni postali sono equiparati ad un assegno bancario e possono essere utilizzati per effettuare pagamenti, trasferire denaro a terzi o prelevare contante presso il proprio Ufficio Postale.
label: Bank or postal check @en
subclass of: Restriction
  some values from: Thing
  on property:
    inverse of: haModalitaDiPagamento