Cassetto fiscale
type: Class
comment: Servizio che consente la consultazione delle proprie informazioni fiscali, come: dati anagrafici, dati delle dichiarazioni fiscali, dati dei rimborsi, dati dei versamenti effettuati tramite modello F24 e F23, atti del registro (dati patrimoniali), dati e informazioni relativi agli studi di settore e agli indicatori sintetici di affidabilità fiscale (Isa), le informazioni sul proprio stato di iscrizione al Vies (VAT information exchange system).
label: Tax drawer @en
subclass of: Restriction
  on property:
    inverse of: inserisceRicevutaPagamentoIn
  some values from: Thing
subclass of: Restriction
  on property:
    inverse of: ricevutaInseritaIn
  some values from: Thing
subclass of: Restriction
  on property: cassettoRelativoAContribuente
  some values from: Thing