Contribuente
type: Class
comment: Soggetto che, ai sensi del diritto tributario statale, è tenuto al versamento di imposte e tributi, stabiliti per legge.
label: Taxpayer @en
subclass of: Restriction
  some values from: Thing
  on property: presentaModelloF24
subclass of: Restriction
  some values from: Thing
  on property: effettuaPagamento
subclass of: Restriction
  some values from: Thing
  on property:
    inverse of: ricopreRuoloContribuente
subclass of: Class
  union of: ContribuenteNonTitolarePartitaIVA
  union of: ContribuenteTitolarePartitaIVA
subclass of: Restriction
  some values from: Thing
  on property:
    inverse of: cassettoRelativoAContribuente