Contribuente non titolare partita IVA
type: Class
disjoint with: ContribuenteTitolarePartitaIVA
comment: Contribuente non titolare di partita Iva.
label: Taxpayer without VAT number @en
subclass of: Contribuente