Debito
type: Class
comment: Importo che INAIL vanta nei confronti del soggetto assicurante per non aver versato le somme dovute o averle versate somme in misura minore.
label: Debt @en
subclass of: Restriction
  on property: importoDebito
  some values from: Literal
subclass of: Restriction
  on property:
    inverse of: autoliquidazioneHaSaldoFinale
  some values from: Thing