Modello pagamento F24
type: Class
comment: Il modello F24 utilizzato da tutti i contribuenti, titolari e non titolari di partita Iva, per il versamento di tributi, contributi e premi assicurativi. È definito “unificato” perché permette di effettuare con un’unica operazione il pagamento delle somme dovute, compensando il versamento con eventuali crediti. I contribuenti titolari di partita Iva hanno l’obbligo di utilizzare, anche tramite intermediari (professionisti, associazioni di categoria, Caf, ecc.), le modalità telematiche di pagamento.
label: F24 model payment @en
subclass of: Restriction
  on property: importoADebitoVersatoContributiAssociativi
  some values from: Literal
subclass of: Class
  union of: ModelloPagamentoF24Cartaceo
  union of: ModelloPagamentoF24Telematico
subclass of: Restriction
  on property: codiceControllo
  some values from: Literal
subclass of: Restriction
  on property:
    inverse of: presentaModelloF24
  some values from: Thing
subclass of: Restriction
  on property: importoPremioACreditoDatoreLavorodaCompensare
  some values from: Literal
subclass of: Restriction
  on property: haEsattore
  some values from: Thing
subclass of: Restriction
  on property:
    inverse of: annullamentoRelativoAF24
  some values from: Thing
subclass of: Restriction
  on property: importoPremioADebitoDatoreLavorodaCompensare
  some values from: Literal
subclass of: Restriction
  on property: causaleF24
  some values from: Literal
subclass of: Restriction
  on property: importoADebitoVersatoPremioINAIL
  some values from: Literal
subclass of: Restriction
  on property: annoDiRiferimentoF24
  some values from: Literal