Modello pagamento F24 enti pubblici
type: Class
comment: Modello F24 utilizzato dagli enti pubblici sottoposti ai vincoli del sistema di tesoreria unica dello Stato (enti individuati dalle tabelle A e B allegate alla Legge n. 720/1984), dalle Amministrazioni centrali dello Stato, titolari di conti presso la tesoreria centrale, nonché dagli enti titolari di contabilità speciale autorizzati dal Dipartimento della Ragioneria Generale dello Stato (I.Ge.P.A.), per il pagamento delle ritenute alla fonte, dell'Irap, dei tributi erariali e comunali, dei contributi previdenziali e dei premi INAIL.
label: F24 Model payment for public institution @en
subclass of: Restriction
  some values from: Thing
  on property:
    inverse of: haModelloDiPagamento
subclass of: ModelloPagamentoF24