Modello pagamento F24 telematico
type: Class
comment: Modello F24 presentato direttamente tramite i servizi telematici messi a disposizione dall'Agenzia delle Entrate ("F24 web" e "F24 online") utilizzando i canali Entratel o Fisconline oppure mediante i servizi di internet banking messi a disposizione dagli intermediari della riscossione convenzionati con l'Agenzia.
label: F24 telematic model payment @en
subclass of: ModelloPagamentoF24