Premio anticipato INAIL
type: Class
comment: L'importo del premio di autoliquidazione anticipato che il datore di lavoro deve versare, calcolato sulla base delle retribuzioni effettive dichiarate per l'anno precedente utilizzate come presunte per l'anno in corso.
label: Advance INAIL premium @en
subclass of: PremioAssicurativoINAIL
disjoint with: RegolazionePremioINAIL