has official announcement
type: ObjectProperty
comment: This object property links the Bando ISI funding program Appendix class to the Regional official announcement class.
comment: Relazione che collega la classe Asse Prevenzione alla classe Avviso Pubblico Regionale. @it
range: AvvisoPubblicoRegionale
domain: AssePrevenzione
label: asse relativa A bando @it
type: FunctionalProperty